Reaction Details
TargetTyrosine-protein kinase SYK
LigandBDBM212277
Substrate/Competitorn/a
Meas. Tech.High Throughput Syk Biochemical Assay
pH7±n/a
IC50 31±n/a nM
Commentsextracted
Citation Blomgren, PACurrie, KSKropf, JELee, SHLo, JRMitchell, SASchmitt, ACXiong, JXu, JZhao, ZSwaminathan, S Substituted imidazo[1,2-a]pyrazines as Syk inhibitors US Patent US9290505 Publication Date 3/22/2016
 
Tyrosine-protein kinase SYK
Name:Tyrosine-protein kinase SYK
Type:Enzyme
Mol. Mass.:72079.99
Organism:Homo sapiens (Human)
Description:P43405
Residue:635
BDBM212277
NameBDBM212277
Synonyms:US11517570, Example Kn.-1: US9504684, 6-(5-aminopyridin-3-yl)-N-(4-morpholinophenyl)imidazo[1,2-a]pyrazin-8-amine
TypeSmall organic molecule
Emp. Form.C21H21N7O
Mol. Mass.387.4377
SMILESNc1cncc(c1)-c1cn2ccnc2c(Nc2ccc(cc2)N2CCOCC2)n1