Reaction Details
TargetProbable salicylate monooxygenase [H213A]
LigandBDBM50336491
Substrate/Competitorn/a
Meas. Tech.Substrate Binding Assay
pH8±n/a
Kd 6.1e+4± 5e+3 nM
Commentsextracted
Citation Montersino, SOrru, RBarendregt, AWestphal, AHvan Duijn, EMattevi, Avan Berkel, WJ Crystal structure of 3-hydroxybenzoate 6-hydroxylase uncovers lipid-assisted flavoprotein strategy for regioselective aromatic hydroxylation. J Biol Chem288:26235-45 (2013) 
 
Probable salicylate monooxygenase [H213A]
Name:Probable salicylate monooxygenase [H213A]
Synonyms:3-Hydroxybenzoate 6-hydroxylase (3HB6H H213A)
Type:Dimeric flavoprotein
Mol. Mass.:43919.01
Organism:Rhodococcus jostii RHA1
Description:R. jostii 3HB6H mutant H213A
Residue:399
BDBM50336491
NameBDBM50336491
TypeSmall organic molecule
Emp. Form.C7H6O3
Mol. Mass.138.1207
SMILESOC(=O)c1cccc(O)c1