Reaction Details
TargetBifunctional cytochrome P450/NADPH--P450 reductase
LigandBDBM212439
Substrate/Competitorn/a
Meas. Tech.Optical Titration Assay
pH7±n/a
Kd 82± 11 nM
Commentsextracted
Citation Butler, CFPeet, CMason, AEVoice, MWLeys, DMunro, AW Key mutations alter the cytochrome P450 BM3 conformational landscape and remove inherent substrate bias. J Biol Chem288:25387-99 (2013) 
 
Bifunctional cytochrome P450/NADPH--P450 reductase
Name:Bifunctional cytochrome P450/NADPH--P450 reductase
Type:Protein
Mol. Mass.:117752.82
Organism:Bacillus megaterium
Description:P14779
Residue:1049
BDBM212439
NameBDBM212439
Synonyms:N-palmitoylglycine (NPG)
TypeSmall organic molecule
Emp. Form.C18H35NO3
Mol. Mass.313.4754
(=O)NCC(O)=O