Reaction Details
TargetBifunctional cytochrome P450/NADPH--P450 reductase [F87V]
LigandBDBM50241343
Substrate/Competitorn/a
Meas. Tech.Optical Titration Assay
pH7±n/a
Kd 4.90e+4± 2.7e+3 nM
Commentsextracted
Citation Butler, CFPeet, CMason, AEVoice, MWLeys, DMunro, AW Key mutations alter the cytochrome P450 BM3 conformational landscape and remove inherent substrate bias. J Biol Chem288:25387-99 (2013) 
 
Bifunctional cytochrome P450/NADPH--P450 reductase [F87V]
Name:Bifunctional cytochrome P450/NADPH--P450 reductase [F87V]
Type:Protein
Mol. Mass.:117704.78
Organism:Bacillus megaterium
Description:B. megaterium BM3 with F87V mutation
Residue:1049
BDBM50241343
NameBDBM50241343
Synonyms:(RS)-6-methoxy-2-((4-methoxy-3,5-dimethylpyridin-2-yl) methylsulfinyl)-1H-benzo[d]imidazole 2-(3-methoxy-2,4-dimethylbenzylsulfinyl)-6-methoxy-1H-benzo[d]imidazole 5-Methoxy-2-(4-methoxy-3,5-dimethyl-pyridin-2-ylmethanesulfinyl)-1H-benzoimidazole (omeprazole) 5-methoxy-2-((4-methoxy-3,5-dimethylpyridin-2-yl)methylsulfinyl)-1H-benzo[d]imidazole 6-methoxy-2-((4-methoxy-3,5-dimethylpyridin-2-yl)methylsulfinyl)-1H-benzo[d]imidazole ESOMEPRAZOLE SODIUM OMEPRAZOLE Prilosec | cid_4594
TypeSmall organic molecule
Emp. Form.C17H19N3O3S
Mol. Mass.345.416
SMILESCOc1ccc2nc([nH]c2c1)S(=O)Cc1ncc(C)c(OC)c1C