Reaction Details
TargetAcetyl-CoA carboxylase 2 [129-967]
LigandBDBM212615
Substrate/Competitorn/a
Meas. Tech.Spectrophotometric 384 Well Assay
pH7.5±n/a
IC50 86±n/a nM
Commentsextracted
Citation Heine, NFleck, MNosse, BRoth, GJ Pyrrolidine derivatives, pharmaceutical compositions and uses thereof US Patent US9278954 Publication Date 3/8/2016
 
Acetyl-CoA carboxylase 2 [129-967]
Name:Acetyl-CoA carboxylase 2 [129-967]
Type:Enzyme
Mol. Mass.:92599.28
Organism:Homo sapiens (Human)
Description:O00763 lacks the 128 amino acids at the N-terminus
Residue:839
BDBM212615
NameBDBM212615
Synonyms:BDBM212741 US9278954, 1.9
TypeSmall organic molecule
Emp. Form.C23H30FN5O2
Mol. Mass.427.515
SMILESCC(C(=O)NC1CC1C)c1ccc(O[C@@H]2CCN(C2)c2nc(ncc2F)N(C)C)cc1