Reaction Details
TargetGuanine nucleotide-binding protein subunit alpha-15 [Y147C]/Metabotropic glutamate receptor 2
LigandBDBM212937
Substrate/Competitorn/a
Meas. Tech.Biological Assay
IC50 11±n/a nM
Citation Bungard, CJConverso, AHanney, BHartingh, TJManley, PJMeissner, RSPerkins, JJRudd, MT Quinoline carboxamide and quinoline carbonitrile derivatives as mGluR2-negative allosteric modulators, compositions, and their use US Patent US9278960 Publication Date 3/8/2016
 
Guanine nucleotide-binding protein subunit alpha-15 [Y147C]/Metabotropic glutamate receptor 2
Name:Guanine nucleotide-binding protein subunit alpha-15 [Y147C]/Metabotropic glutamate receptor 2
Synonyms:mGluR2 and G alpha 16
Type:Protein
Mol. Mass.:n/a
Description:n/a
Components:This complex has 2 components.
Component 1
Name:Metabotropic glutamate receptor 2
Type:Enzyme
Mol. Mass.:95584.88
Organism:Homo sapiens (Human)
Description:Q14416
Residue:872
Component 2
Name:Guanine nucleotide-binding protein subunit alpha-15 [Y147C]
Synonyms:G protein alpha 16 GNA15_HUMAN | GNA16
Type:Enzyme
Mol. Mass.:43517.59
Organism:Homo sapiens (Human)
Description:P30679[Y147C]
Residue:374
BDBM212937
NameBDBM212937
Synonyms:US9278960, 4-22-A | US9278960, 4-22-B
TypeSmall organic molecule
Emp. Form.C23H22F4N4O
Mol. Mass.446.4406
SMILESC[C@H]1CNC(CN1Cc1ccc2c(cc(nc2c1)C(N)=O)-c1ccc(F)cc1)C(F)(F)F