Reaction Details
TargetGuanine nucleotide-binding protein subunit alpha-15 [Y147C]/Metabotropic glutamate receptor 2
LigandBDBM213137
Substrate/Competitorn/a
Meas. Tech.Biological Assay
IC50 8±n/a nM
Citation Bungard, CJConverso, AHanney, BHartingh, TJManley, PJMeissner, RSPerkins, JJRudd, MT Quinoline carboxamide and quinoline carbonitrile derivatives as mGluR2-negative allosteric modulators, compositions, and their use US Patent US9278960 Publication Date 3/8/2016
 
Guanine nucleotide-binding protein subunit alpha-15 [Y147C]/Metabotropic glutamate receptor 2
Name:Guanine nucleotide-binding protein subunit alpha-15 [Y147C]/Metabotropic glutamate receptor 2
Synonyms:mGluR2 and G alpha 16
Type:Protein
Mol. Mass.:n/a
Description:n/a
Components:This complex has 2 components.
Component 1
Name:Metabotropic glutamate receptor 2
Type:Enzyme
Mol. Mass.:95584.88
Organism:Homo sapiens (Human)
Description:Q14416
Residue:872
Component 2
Name:Guanine nucleotide-binding protein subunit alpha-15 [Y147C]
Synonyms:G protein alpha 16 GNA15_HUMAN | GNA16
Type:Enzyme
Mol. Mass.:43517.59
Organism:Homo sapiens (Human)
Description:P30679[Y147C]
Residue:374
BDBM213137
NameBDBM213137
Synonyms:US9278960, 8-44 US9636337, 8-45
TypeSmall organic molecule
Emp. Form.C25H22FN3O2
Mol. Mass.415.4595
SMILESCOc1ccc(c(F)c1)-c1cc(nc2cc(ccc12)C(C)Cc1cccnc1)C(N)=O