Reaction Details
TargetGuanine nucleotide-binding protein subunit alpha-15 [Y147C]/Metabotropic glutamate receptor 2
LigandBDBM213141
Substrate/Competitorn/a
Meas. Tech.Biological Assay
IC50 9±n/a nM
Citation Bungard, CJConverso, AHanney, BHartingh, TJManley, PJMeissner, RSPerkins, JJRudd, MT Quinoline carboxamide and quinoline carbonitrile derivatives as mGluR2-negative allosteric modulators, compositions, and their use US Patent US9278960 Publication Date 3/8/2016
 
Guanine nucleotide-binding protein subunit alpha-15 [Y147C]/Metabotropic glutamate receptor 2
Name:Guanine nucleotide-binding protein subunit alpha-15 [Y147C]/Metabotropic glutamate receptor 2
Type:Protein
Mol. Mass.:n/a
Description:n/a
Components:This complex has 2 components.
Component 1
Name:Metabotropic glutamate receptor 2
Synonyms:GPRC1B GRM2_HUMAN Metabotropic glutamate receptor mGlu2 | metabotropic glutamate 2
Type:Enzyme
Mol. Mass.:95584.88
Organism:Homo sapiens (Human)
Description:Q14416
Residue:872
Component 2
Name:Guanine nucleotide-binding protein subunit alpha-15
Synonyms:G protein alpha 16 G-protein subunit alpha-16 (G alpha-16) GNA15_HUMAN Guanine nucleotide-binding protein subunit alpha-15 [Y147C]
Type:Protein
Mol. Mass.:43577.62
Organism:Homo sapiens (Human)
Description:P30679
Residue:374
BDBM213141
NameBDBM213141
Synonyms:US9278960, 8-48 US9636337, 8-49
TypeSmall organic molecule
Emp. Form.C26H23F2N3O2
Mol. Mass.447.4765
SMILESCOc1ccc(c(F)c1)-c1cc(nc2cc(ccc12)C(C)Cc1ccc(CF)nc1)C(N)=O