Reaction Details
TargetDimer of Prostaglandin G/H synthase 2 [Y385F]
LigandBDBM209868
Substrate/Competitorn/a
Meas. Tech.POX Assay
pH8±n/a
Kd 1.6e+3± 2e+2 nM
Commentsextracted
Citation Dong, LSharma, NPJurban, BJSmith, WL Pre-existent asymmetry in the human cyclooxygenase-2 sequence homodimer. J Biol Chem288:28641-55 (2013) 
 
Dimer of Prostaglandin G/H synthase 2 [Y385F]
Name:Dimer of Prostaglandin G/H synthase 2 [Y385F]
Synonyms:His8-Y385F/His8-Y385F
Type:Enzyme
Mol. Mass.:n/a
Description:n/a
Components:This complex has 2 components.
Component 1
Name:Prostaglandin G/H synthase 2 [Y385F]
Type:Enzyme
Mol. Mass.:70089.04
Organism:Homo sapiens (Human)
Description:Human PGHS-2 Y385F mutant with an octahistidine tag at the N terminus
Residue:612
Component 2
Name:Prostaglandin G/H synthase 2 [Y385F]
Synonyms:COX2 PTGS2 | Prostaglandin endoperoxide H synthase-2 (His8-Y385F)
Type:Enzyme
Mol. Mass.:70089.04
Organism:Homo sapiens (Human)
Description:Human PGHS-2 Y385F mutant with an octahistidine tag at the N terminus
Residue:612
BDBM209868
NameBDBM209868
Synonyms:3-[18-(2-carboxyethyl)-8,13-bis(ethenyl)-3,7,12,17-tetramethylporphyrin-21,24-diid-2-yl]propanoic acid;iron(2+) Heme
TypeSmall organic molecule
Emp. Form.C34H32N4O4
Mol. Mass.560.6434
SMILESCc1c(C=C)c2cc3[n-]c(cc4[n-]c(cc5nc(cc1n2)c(C=C)c5C)c(C)c4CCC(O)=O)c(CCC(O)=O)c3C