Reaction Details
TargetTyrosine-protein kinase ITK/TSK [357-620,Y512E]
LigandBDBM213226
Substrate/Competitorn/a
Meas. Tech.LanthaScreen Kinase Binding Assay
IC50 40±0 nM
Citation Harling, JDDeakin, AMCampos, SGrimley, RChaudry, LNye, CPolyakova, OBessant, CMBarton, NSomers, DBarrett, JGraves, RHHanns, LKerr, WJSolari, R Discovery of novel irreversible inhibitors of interleukin (IL)-2-inducible tyrosine kinase (Itk) by targeting cysteine 442 in the ATP pocket. J Biol Chem288:28195-206 (2013) 
 
Tyrosine-protein kinase ITK/TSK [357-620,Y512E]
Name:Tyrosine-protein kinase ITK/TSK [357-620,Y512E]
Type:Enzyme
Mol. Mass.:30027.99
Organism:Homo sapiens (Human)
Description:Human Itk truncation (357-620 aa) with Y512E mutation
Residue:264
BDBM213226
NameBDBM213226
Synonyms:N-{(3S)-1-[(2E)-2-Butenoyl]-3-pyrrolidinyl}-4-{[cis-2,6-dimethyl-4-morpholinyl]methyl}-N'-[1,3]thiazolo[5,4-b]pyridin-2-yl-2,6-pyridinediamine (16)
TypeSmall organic molecule
Emp. Form.C26H33N7O2S
Mol. Mass.507.651
SMILESC\C=C\C(=O)N1CC[C@@H](C1)Nc1cc(CN2C[C@H](C)O[C@H](C)C2)cc(Nc2nc3cccnc3s2)n1