Reaction Details
TargetHistone deacetylase 4
LigandBDBM19410
Substrate/Competitorn/a
Meas. Tech.Enzymatic HDAC Activity Assay
pH7.5±n/a
IC50>1.0e+4±n/a nM
Commentsextracted
Citation Lauffer, BEMintzer, RFong, RMukund, STam, CZilberleyb, IFlicke, BRitscher, AFedorowicz, GVallero, ROrtwine, DFGunzner, JModrusan, ZNeumann, LKoth, CMLupardus, PJKaminker, JSHeise, CESteiner, P Histone deacetylase (HDAC) inhibitor kinetic rate constants correlate with cellular histone acetylation but not transcription and cell viability. J Biol Chem288:26926-43 (2013) 
 
Histone deacetylase 4
Name:Histone deacetylase 4
Type:Enzyme
Mol. Mass.:119049.39
Organism:Homo sapiens (Human)
Description:P56524
Residue:1084
BDBM19410
NameBDBM19410
Synonyms:CHEMBL27759 US11377423, MS-275 US9265734, MS-275 benzamide-type inhibitor, 3 | pyridin-3-ylmethyl N-({4-[(2-aminophenyl)carbamoyl]phenyl}methyl)carbamate
TypeSmall organic molecule
Emp. Form.C21H20N4O3
Mol. Mass.376.4085
SMILESNc1ccccc1NC(=O)c1ccc(CNC(=O)OCc2cccnc2)cc1