Reaction Details
TargetSerine/threonine-protein kinase PAK 2
LigandBDBM50112347
Substrate/Competitorn/a
Meas. Tech.Z'-LYTEBiochemical Assay
IC50 12.8±0.0 nM
Citation Licciulli, SMaksimoska, JZhou, CTroutman, SKota, SLiu, QDuron, SCampbell, DChernoff, JField, JMarmorstein, RKissil, JL FRAX597, a small molecule inhibitor of the p21-activated kinases, inhibits tumorigenesis of neurofibromatosis type 2 (NF2)-associated Schwannomas. J Biol Chem288:29105-14 (2013) 
 
Serine/threonine-protein kinase PAK 2
Name:Serine/threonine-protein kinase PAK 2
Type:Enzyme
Mol. Mass.:58037.40
Organism:Homo sapiens (Human)
Description:Q13177
Residue:524
BDBM50112347
NameBDBM50112347
Synonyms:CHEMBL3609327 | FRAX597
TypeSmall organic molecule
Emp. Form.C29H28ClN7OS
Mol. Mass.558.097
SMILESCCn1c2nc(Nc3ccc(cc3)N3CCN(C)CC3)ncc2cc(-c2ccc(cc2Cl)-c2cncs2)c1=O