Reaction Details
TargetBaculoviral IAP repeat-containing protein 2 [256-363]
LigandBDBM213386
Substrate/Competitorn/a
Meas. Tech.XIAP BIR3 & cIAP1 BIR3 Binding Assays (DELFIA)
Temperature298.15±n/a K
IC50 1±n/a nM
Commentsextracted
Citation Reiser, UMadden, J 6-Alkynyl Pyridine US Patent US9278978 Publication Date 3/8/2016
 
Baculoviral IAP repeat-containing protein 2 [256-363]
Name:Baculoviral IAP repeat-containing protein 2 [256-363]
Type:Enzyme
Mol. Mass.:12600.71
Organism:Homo sapiens (Human)
Description:Human cIAP BIR3 domain (256-363 aa)
Residue:108
BDBM213386
NameBDBM213386
Synonyms:US9278978, 21
TypeSmall organic molecule
Emp. Form.C27H27N11O
Mol. Mass.521.5764
SMILESCN[C@H](C)C(=O)Nc1cc(cc(n1)C#Cc1cnc(nc1)-n1cnc(C)c1)-c1nc(C)nc2nn(C)c(C)c12