Reaction Details
TargetBaculoviral IAP repeat-containing protein 2 [256-363]
LigandBDBM213407
Substrate/Competitorn/a
Meas. Tech.XIAP BIR3 & cIAP1 BIR3 Binding Assays (DELFIA)
Temperature298.15±n/a K
IC50 1±n/a nM
Commentsextracted
Citation Reiser, UMadden, J 6-Alkynyl Pyridine US Patent US9278978 Publication Date 3/8/2016
 
Baculoviral IAP repeat-containing protein 2 [256-363]
Name:Baculoviral IAP repeat-containing protein 2 [256-363]
Type:Enzyme
Mol. Mass.:12600.71
Organism:Homo sapiens (Human)
Description:Human cIAP BIR3 domain (256-363 aa)
Residue:108
BDBM213407
NameBDBM213407
Synonyms:US9278978, 42
TypeSmall organic molecule
Emp. Form.C27H23FN8O
Mol. Mass.494.5229
SMILESCNC(C)C(=O)Nc1cc(cc(n1)C#Cc1cc(F)c2ncccc2c1)-c1ncnc2c(C)nn(C)c12