Reaction Details
TargetTyrosine-protein kinase ABL1 [64-515]
LigandBDBM213662
Substrate/Competitorn/a
Meas. Tech.Radio ABL1 (64-515) Assay
pH7.5±n/a
Temperature298.15±n/a K
IC50<0.1±n/a nM
Commentsextracted
Citation Furet, PGrotzfeld, RMJahnke, WJones, DBManley, PWMarzinzik, APelle, XFSalem, BSchoepfer, JSpieser, EA Compounds and compositions for inhibiting the activity of ABL1, ABL2 and BCR-ABL1 US Patent US9278981 Publication Date 3/8/2016
 
Tyrosine-protein kinase ABL1 [64-515]
Name:Tyrosine-protein kinase ABL1 [64-515]
Type:Enzyme Catalytic Domain
Mol. Mass.:51539.77
Organism:Homo sapiens (Human)
Description:aa 64-515
Residue:452
BDBM213662
NameBDBM213662
Synonyms:US9278981, 254
TypeSmall organic molecule
Emp. Form.C22H16ClF2N7O2
Mol. Mass.483.858
SMILESFC(F)(Cl)Oc1ccc(NC(=O)c2cnc(N3Cc4cn[nH]c4C3)c(c2)-c2cncnc2)cc1