Reaction Details
TargetTyrosine-protein kinase ABL1 [64-515]
LigandBDBM213516
Substrate/Competitorn/a
Meas. Tech.Caliper ABL
pH7.5±n/a
Temperature303.15±n/a K
IC50 0.3±n/a nM
Commentsextracted
Citation Furet, PGrotzfeld, RMJahnke, WJones, DBManley, PWMarzinzik, APelle, XFSalem, BSchoepfer, JSpieser, EA Compounds and compositions for inhibiting the activity of ABL1, ABL2 and BCR-ABL1 US Patent US9278981 Publication Date 3/8/2016
 
Tyrosine-protein kinase ABL1 [64-515]
Name:Tyrosine-protein kinase ABL1 [64-515]
Type:Enzyme Catalytic Domain
Mol. Mass.:51539.77
Organism:Homo sapiens (Human)
Description:aa 64-515
Residue:452
BDBM213516
NameBDBM213516
Synonyms:US9278981, 108
TypeSmall organic molecule
Emp. Form.C22H21F3N6O2
Mol. Mass.458.4363
SMILESNC[C@@H]1CCN(C1)c1ncc(cc1-c1cncnc1)C(=O)Nc1ccc(OC(F)(F)F)cc1