Reaction Details
TargetTyrosine-protein kinase ABL1 [64-515]
LigandBDBM213579
Substrate/Competitorn/a
Meas. Tech.Caliper ABL
pH7.5±n/a
Temperature303.15±n/a K
IC50<0.13±n/a nM
Commentsextracted
Citation Furet, PGrotzfeld, RMJahnke, WJones, DBManley, PWMarzinzik, APelle, XFSalem, BSchoepfer, JSpieser, EA Compounds and compositions for inhibiting the activity of ABL1, ABL2 and BCR-ABL1 US Patent US9278981 Publication Date 3/8/2016
 
Tyrosine-protein kinase ABL1 [64-515]
Name:Tyrosine-protein kinase ABL1 [64-515]
Type:Enzyme Catalytic Domain
Mol. Mass.:51539.77
Organism:Homo sapiens (Human)
Description:aa 64-515
Residue:452
BDBM213579
NameBDBM213579
Synonyms:US9278981, 171
TypeSmall organic molecule
Emp. Form.C22H18ClF3N4O3
Mol. Mass.478.852
SMILESO[C@@H]1CCN(C1)c1ncc(cc1-c1cncc(F)c1)C(=O)Nc1ccc(OC(F)(F)Cl)cc1