Reaction Details
TargetTyrosine-protein kinase ABL1
LigandBDBM213578
Substrate/Competitorn/a
Meas. Tech.Cellular Proliferation Assay
IC50 13±n/a nM
Citation Furet, PGrotzfeld, RMJahnke, WJones, DBManley, PWMarzinzik, APelle, XFSalem, BSchoepfer, JSpieser, EA Compounds and compositions for inhibiting the activity of ABL1, ABL2 and BCR-ABL1 US Patent US9278981 Publication Date 3/8/2016
 
Tyrosine-protein kinase ABL1
Name:Tyrosine-protein kinase ABL1
Type:Enzyme
Mol. Mass.:122897.30
Organism:Homo sapiens (Human)
Description:P00519
Residue:1130
BDBM213578
NameBDBM213578
Synonyms:US9278981, 170
TypeSmall organic molecule
Emp. Form.C21H18ClF2N5O3
Mol. Mass.461.849
SMILESO[C@@H]1CCN(C1)c1ncc(cc1-c1cncnc1)C(=O)Nc1ccc(OC(F)(F)Cl)cc1