Reaction Details
TargetMacrophage-stimulating protein receptor [983-1400,G1195S]
LigandBDBM213708
Substrate/Competitorn/a
Meas. Tech.Enzyme Assay
pH7.5±n/a
Temperature298.15±n/a K
IC50 4.3±0.0 nM
Commentsextracted
Citation Staehle, WSchadt, OKnuehl, CFriese-Hamim, MHuck, BRGoutopoulos, ABrugger, N Pyrido-pyrimidine derivatives US Patent US9283225 Publication Date 3/15/2016
 
Macrophage-stimulating protein receptor [983-1400,G1195S]
Name:Macrophage-stimulating protein receptor [983-1400,G1195S]
Type:Protein
Mol. Mass.:47287.22
Organism:Homo sapiens (Human)
Description:MST1R (RON) recombinant human protein (Life Technologies, 983-1400 aa)
Residue:418
BDBM213708
NameBDBM213708
Synonyms:US9283225, A1
TypeSmall organic molecule
Emp. Form.C24H16F4N6O3
Mol. Mass.512.4159
SMILESFc1cc(NC(=O)c2cnn(c2C(F)(F)F)-c2ccccc2)ccc1Oc1ccnc2NC(=O)NCc12