Reaction Details
TargetCatenin beta-1 [138-686]
LigandBDBM213751
Substrate/Competitorn/a
Meas. Tech.Fluorescence Polarization (FP) Assay
Temperature298.15±n/a K
Ki 165400±1450 nM
Commentsextracted
Citation Ji, HYu, BZhang, MGuo, W Substituted 1H-indazol-1-ol analogs as inhibitors of beta catenin/Tcf protein-protein interactions US Patent US9284299 Publication Date 3/15/2016
 
Catenin beta-1 [138-686]
Name:Catenin beta-1 [138-686]
Type:Protein
Mol. Mass.:60127.24
Organism:Homo sapiens (Human)
Description:aa 138-686
Residue:549
BDBM213751
NameBDBM213751
Synonyms:US9284299, 10 US9738628, Compound 10
TypeSmall organic molecule
Emp. Form.C9H7N5O3
Mol. Mass.233.1836
SMILESOn1nnc2cc(Cc3noc(=O)[nH]3)ccc12