Reaction Details
TargetCatenin beta-1 [138-686]
LigandBDBM213757
Substrate/Competitorn/a
Meas. Tech.Fluorescence Polarization (FP) Assay
Temperature298.15±n/a K
Ki 50400±3110 nM
Commentsextracted
Citation Ji, HYu, BZhang, MGuo, W Substituted 1H-indazol-1-ol analogs as inhibitors of beta catenin/Tcf protein-protein interactions US Patent US9284299 Publication Date 3/15/2016
 
Catenin beta-1 [138-686]
Name:Catenin beta-1 [138-686]
Type:Protein
Mol. Mass.:60127.24
Organism:Homo sapiens (Human)
Description:aa 138-686
Residue:549
BDBM213757
NameBDBM213757
Synonyms:US9284299, 8 | US9738628, Compound 8
TypeSmall organic molecule
Emp. Form.C8H7N7O2
Mol. Mass.233.1869
SMILESOn1nnc2cc(OCc3nn[nH]n3)ccc12