Reaction Details
TargetCatenin beta-1 [138-686]
LigandBDBM213764
Substrate/Competitorn/a
Meas. Tech.Fluorescence Polarization (FP) Assay
Temperature298.15±n/a K
Ki 13550±190 nM
Commentsextracted
Citation Ji, HYu, BZhang, MGuo, W Substituted 1H-indazol-1-ol analogs as inhibitors of beta catenin/Tcf protein-protein interactions US Patent US9284299 Publication Date 3/15/2016
 
Catenin beta-1 [138-686]
Name:Catenin beta-1 [138-686]
Type:Protein
Mol. Mass.:60127.24
Organism:Homo sapiens (Human)
Description:aa 138-686
Residue:549
BDBM213764
NameBDBM213764
Synonyms:US9284299, 15
TypeSmall organic molecule
Emp. Form.C10H11N6O2
Mol. Mass.247.2333
SMILESOn1ncc2cc(COC[N]3=NNN=C3)ccc12