Reaction Details
TargetCatenin beta-1 [138-686]
LigandBDBM50094602
Substrate/Competitorn/a
Meas. Tech.AlphaScreen Assay
pH7.4±n/a
Temperature298.15±n/a K
Ki 40670±1020 nM
Commentsextracted
Citation Ji, HYu, BZhang, MGuo, W Substituted 1H-indazol-1-ol analogs as inhibitors of beta catenin/Tcf protein-protein interactions US Patent US9284299 Publication Date 3/15/2016
 
Catenin beta-1 [138-686]
Name:Catenin beta-1 [138-686]
Type:Protein
Mol. Mass.:60127.24
Organism:Homo sapiens (Human)
Description:aa 138-686
Residue:549
BDBM50094602
NameBDBM50094602
Synonyms:CHEMBL3589010 US9738628, Compound iCRT14
TypeSmall organic molecule
Emp. Form.C21H17N3O2S
Mol. Mass.375.444
SMILESCc1cc(\C=C2/SC(=O)N(C2=O)c2ccccc2)c(C)n1-c1cccnc1