Reaction Details
TargetCatenin beta-1 [138-686]/Transcription factor 4 [7-51]
LigandBDBM213761
Substrate/Competitorn/a
Meas. Tech.AlphaScreen Assay
pH7.4±n/a
Temperature298.15±n/a K
Ki 3830±450 nM
Commentsextracted
Citation Ji, HYu, BZhang, MGuo, W Substituted 1H-indazol-1-ol analogs as inhibitors of beta catenin/Tcf protein-protein interactions US Patent US9284299 Publication Date 3/15/2016
 
Catenin beta-1 [138-686]/Transcription factor 4 [7-51]
Name:Catenin beta-1 [138-686]/Transcription factor 4 [7-51]
Synonyms:Beta-catenin/Tcf4
Type:Enzyme
Mol. Mass.:n/a
Description:n/a
Components:This complex has 2 components.
Component 1
Name:Catenin beta-1 [138-686]
Type:Protein
Mol. Mass.:60127.24
Organism:Homo sapiens (Human)
Description:aa 138-686
Residue:549
Component 2
Name:Transcription factor 4 [7-51]
Synonyms:BHLHB19 ITF2_HUMAN TCF4 | Transcription factor 4 (TCF4)
Type:Enzyme
Mol. Mass.:4569.48
Organism:Homo sapiens (Human)
Description:Human Tcf4 truncation (7-51 aa)
Residue:45
BDBM213761
NameBDBM213761
Synonyms:US9284299, 12 | US9738628, Compound 12
TypeSmall organic molecule
Emp. Form.C9H9N7O
Mol. Mass.231.2141
SMILESOn1nnc2cc(CCc3nn[nH]n3)ccc12