Reaction Details
TargetCatenin beta-1 [138-686]/Transcription factor 4 [7-51]
LigandBDBM32102
Substrate/Competitorn/a
Meas. Tech.Fluorescence Polarization (FP) Assay
Temperature298.15±n/a K
Ki 5820±240 nM
Commentsextracted
Citation Ji, HYu, BZhang, MGuo, W Substituted 1H-indazol-1-ol analogs as inhibitors of beta catenin/Tcf protein-protein interactions US Patent US9284299 Publication Date 3/15/2016
 
Catenin beta-1 [138-686]/Transcription factor 4 [7-51]
Name:Catenin beta-1 [138-686]/Transcription factor 4 [7-51]
Synonyms:Beta-catenin/Tcf4
Type:Enzyme
Mol. Mass.:n/a
Description:n/a
Components:This complex has 2 components.
Component 1
Name:Catenin beta-1 [138-686]
Type:Protein
Mol. Mass.:60127.24
Organism:Homo sapiens (Human)
Description:aa 138-686
Residue:549
Component 2
Name:Transcription factor 4 [7-51]
Synonyms:BHLHB19 ITF2_HUMAN TCF4 | Transcription factor 4 (TCF4)
Type:Enzyme
Mol. Mass.:4569.48
Organism:Homo sapiens (Human)
Description:Human Tcf4 truncation (7-51 aa)
Residue:45
BDBM32102
NameBDBM32102
Synonyms:1,6-dimethylpyrimido[5,4-e][1,2,4]triazine-5,7(1H,6H)-dione 1,6-dimethylpyrimido[5,4-e][1,2,4]triazine-5,7-quinone SMR000024051 US9738628, Compound PKF118-310 | cid_66541
TypeSmall organic molecule
Emp. Form.C7H7N5O2
Mol. Mass.193.1628
SMILESCn1ncnc2c1nc(=O)n(C)c2=O