Reaction Details
TargetCadherin-1 [819-873]/Catenin beta-1 [138-686]
LigandBDBM50094484
Substrate/Competitorn/a
Meas. Tech.Fluorescence Polarization (FP) Assay
Temperature298.15±n/a K
Ki 14390±320 nM
Commentsextracted
Citation Ji, HYu, BZhang, MGuo, W Substituted 1H-indazol-1-ol analogs as inhibitors of beta catenin/Tcf protein-protein interactions US Patent US9284299 Publication Date 3/15/2016
 
Cadherin-1 [819-873]/Catenin beta-1 [138-686]
Name:Cadherin-1 [819-873]/Catenin beta-1 [138-686]
Synonyms:Beta-catenin/E-cadherin
Type:Enzyme
Mol. Mass.:n/a
Description:n/a
Components:This complex has 2 components.
Component 1
Name:Catenin beta-1 [138-686]
Type:Protein
Mol. Mass.:60127.24
Organism:Homo sapiens (Human)
Description:aa 138-686
Residue:549
Component 2
Name:Cadherin-1 [819-873]
Synonyms:CADH1_HUMAN CDHE UVO
Type:Enzyme
Mol. Mass.:6102.29
Organism:Homo sapiens (Human)
Description:Human E-cadherin truncation (819-873 aa)
Residue:55
BDBM50094484
NameBDBM50094484
Synonyms:CHEBI:3556 US9284299, CGP049090 | US9738628, Compound CGP049090
TypeSmall organic molecule
Emp. Form.C29H26O10
Mol. Mass.534.5107
SMILESCOc1c(C[C@H](C)O)c2c3c(C[C@H](C)O)c(OC)c(=O)c4c(O)cc5OCOc6cc(O)c(c2c6c5c34)c1=O