Reaction Details
TargetSterol 14-alpha demethylase
LigandBDBM213822
Substrate/Competitorn/a
Meas. Tech.CYP51 Inhibition Assay
pH7.4±n/a
Temperature310.15±n/a K
Kd 32± 2 nM
Commentsextracted
Citation Hargrove, TYWawrzak, ZAlexander, PWChaplin, JHKeenan, MCharman, SAPerez, CJWaterman, MRChatelain, ELepesheva, GI Complexes of Trypanosoma cruzi sterol 14a-demethylase (CYP51) with two pyridine-based drug candidates for Chagas disease: structural basis for pathogen selectivity. J Biol Chem288:31602-15 (2013) 
 
Sterol 14-alpha demethylase
Name:Sterol 14-alpha demethylase
Type:Protein
Mol. Mass.:54690.12
Organism:Trypanosoma cruzi
Description:Q7Z1V1
Residue:481
BDBM213822
NameBDBM213822
Synonyms:EPL-BS0967 (UDD)
TypeSmall organic molecule
Emp. Form.C23H20F6N4
Mol. Mass.466.4221
SMILESFC(F)(F)c1ccc(cc1)N(C1CCN(CC1)c1ccc(cn1)C(F)(F)F)c1cccnc1