Reaction Details
TargetMuscarinic acetylcholine receptor M3
LigandBDBM103744
Substrate/Competitorn/a
Meas. Tech.Radioligand Binding Assay
Ki 0.100±n/a nM
Citation Hughes, ADByun, DChen, YFleury, MJacobsen, JRStangeland, ELWilson, RDYen, R Diamide compounds having muscarinic receptor antagonist and β2 adrenergic receptor agonist activity US Patent US9572802 Publication Date 2/21/2017
 
Muscarinic acetylcholine receptor M3
Name:Muscarinic acetylcholine receptor M3
Type:Enzyme
Mol. Mass.:66151.03
Organism:Homo sapiens (Human)
Description:P20309
Residue:590
BDBM103744
NameBDBM103744
Synonyms:US8551978, I-9 US9394275, I-9 US9682957, I-9
TypeSmall organic molecule
Emp. Form.C46H54N6O8
Mol. Mass.818.9564
SMILESCOc1ccc(NC(=O)CCCN(C)C(=O)CCN2CCC(CC2)OC(=O)Nc2ccccc2-c2ccccc2)cc1CCNC[C@H](O)c1ccc(O)c2[nH]c(=O)ccc12