Reaction Details
TargetMuscarinic acetylcholine receptor M3
LigandBDBM103795
Substrate/Competitorn/a
Meas. Tech.Radioligand Binding Assay
Ki 0.100±n/a nM
Citation Hughes, ADByun, DChen, YFleury, MJacobsen, JRStangeland, ELWilson, RDYen, R Diamide compounds having muscarinic receptor antagonist and β2 adrenergic receptor agonist activity US Patent US9572802 Publication Date 2/21/2017
 
Muscarinic acetylcholine receptor M3
Name:Muscarinic acetylcholine receptor M3
Type:Enzyme
Mol. Mass.:66151.03
Organism:Homo sapiens (Human)
Description:P20309
Residue:590
BDBM103795
NameBDBM103795
Synonyms:US8551978, I-65 US9394275, I-65 US9682957, I-65
TypeSmall organic molecule
Emp. Form.C50H54N6O7
Mol. Mass.850.9998
SMILESCN(C(=O)CCN1CCC(CC1)OC(=O)Nc1ccccc1-c1ccccc1)c1ccc(CC(=O)NCc2cccc(CCNC[C@H](O)c3ccc(O)c4[nH]c(=O)ccc34)c2)cc1