Reaction Details
TargetMuscarinic acetylcholine receptor M3
LigandBDBM103796
Substrate/Competitorn/a
Meas. Tech.Radioligand Binding Assay
Ki 0.100±n/a nM
Citation Hughes, ADByun, DChen, YFleury, MJacobsen, JRStangeland, ELWilson, RDYen, R Diamide compounds having muscarinic receptor antagonist and β2 adrenergic receptor agonist activity US Patent US9572802 Publication Date 2/21/2017
 
Muscarinic acetylcholine receptor M3
Name:Muscarinic acetylcholine receptor M3
Type:Enzyme
Mol. Mass.:66151.03
Organism:Homo sapiens (Human)
Description:P20309
Residue:590
BDBM103796
NameBDBM103796
Synonyms:US8551978, 322 US8816088, I-66 US9394275, I-66 US9682957, I-67
TypeSmall organic molecule
Emp. Form.C51H56N6O7
Mol. Mass.865.0263
SMILESCC(Cc1ccc(CNC(=O)Cc2ccc(cc2)N(C)C(=O)CCN2CCC(CC2)OC(=O)Nc2ccccc2-c2ccccc2)cc1)NC[C@H](O)c1ccc(O)c2[nH]c(=O)ccc12