Reaction Details
TargetIsoform Tau-F of Microtubule-associated protein tau
LigandBDBM75309
Substrate/Competitorn/a
Meas. Tech.Tau Protein Assay
pH7.4±n/a
IC50 9.6e+2± 2.5e+2 nM
Commentsextracted
Citation Schafer, KNCisek, KHuseby, CJChang, EKuret, J Structural determinants of Tau aggregation inhibitor potency. J Biol Chem288:32599-611 (2013) 
 
Isoform Tau-F of Microtubule-associated protein tau
Name:Isoform Tau-F of Microtubule-associated protein tau
Type:Enzyme Catalytic Domain
Mol. Mass.:45857.42
Organism:Homo sapiens (Human)
Description:P10636-8
Residue:441
BDBM75309
NameBDBM75309
Synonyms:(2Z)-3-ethyl-2-[(E)-3-(3-ethyl-1,3-benzothiazol-3-ium-2-yl)prop-2-enylidene]-1,3-benzothiazole;iodide MLS001032120 cid_5709759
TypeSmall organic molecule
Emp. Form.C21H21N2S2
Mol. Mass.365.534
SMILESCCN1\C(Sc2ccccc12)=C\C=C\c1sc2ccccc2[n+]1CC