Reaction Details
TargetIsoform Tau-F of Microtubule-associated protein tau
LigandBDBM214727
Substrate/Competitorn/a
Meas. Tech.Tau Protein Assay
pH7.4±n/a
IC50 1.28e+3± 3.2e+2 nM
Commentsextracted
Citation Schafer, KNCisek, KHuseby, CJChang, EKuret, J Structural determinants of Tau aggregation inhibitor potency. J Biol Chem288:32599-611 (2013) 
 
Isoform Tau-F of Microtubule-associated protein tau
Name:Isoform Tau-F of Microtubule-associated protein tau
Type:Enzyme Catalytic Domain
Mol. Mass.:45857.42
Organism:Homo sapiens (Human)
Description:P10636-8
Residue:441
BDBM214727
NameBDBM214727
Synonyms:Azure B (11)
TypeSmall organic molecule
Emp. Form.C15H16N3S
Mol. Mass.270.372
SMILESCNc1ccc2nc3ccc(cc3sc2c1)=[N+](C)C