Reaction Details
TargetIsoform Tau-F of Microtubule-associated protein tau
LigandBDBM214735
Substrate/Competitorn/a
Meas. Tech.Tau Protein Assay
pH7.4±n/a
IC50 2.3e+2±n/a nM
Commentsextracted
Citation Schafer, KNCisek, KHuseby, CJChang, EKuret, J Structural determinants of Tau aggregation inhibitor potency. J Biol Chem288:32599-611 (2013) 
 
Isoform Tau-F of Microtubule-associated protein tau
Name:Isoform Tau-F of Microtubule-associated protein tau
Type:Enzyme Catalytic Domain
Mol. Mass.:45857.42
Organism:Homo sapiens (Human)
Description:P10636-8
Residue:441
BDBM214735
NameBDBM214735
Synonyms:Rhodanines, 23A
TypeSmall organic molecule
Emp. Form.C22H17N2O4S2
Mol. Mass.437.512
SMILES[O-]C(=O)CCCN1C(=S)S\C(=C/c2ccc(o2)-c2ccc(cc2)-n2cccc2)C1=O