Reaction Details
TargetIsoform Tau-F of Microtubule-associated protein tau
LigandBDBM214745
Substrate/Competitorn/a
Meas. Tech.Tau Protein Assay
pH7.4±n/a
IC50 7.3e+2±n/a nM
Commentsextracted
Citation Schafer, KNCisek, KHuseby, CJChang, EKuret, J Structural determinants of Tau aggregation inhibitor potency. J Biol Chem288:32599-611 (2013) 
 
Isoform Tau-F of Microtubule-associated protein tau
Name:Isoform Tau-F of Microtubule-associated protein tau
Type:Enzyme Catalytic Domain
Mol. Mass.:45857.42
Organism:Homo sapiens (Human)
Description:P10636-8
Residue:441
BDBM214745
NameBDBM214745
Synonyms:Rhodanines, 33A
TypeSmall organic molecule
Emp. Form.C29H20NO4S2
Mol. Mass.510.604
SMILES[O-]C(=O)Cc1ccc(CN2C(=S)S\C(=C/c3ccc(o3)-c3ccc(cc3)-c3ccccc3)C2=O)cc1