Reaction Details
TargetIsoform Tau-F of Microtubule-associated protein tau
LigandBDBM214747
Substrate/Competitorn/a
Meas. Tech.Tau Protein Assay
pH7.4±n/a
IC50 7.8e+2±n/a nM
Commentsextracted
Citation Schafer, KNCisek, KHuseby, CJChang, EKuret, J Structural determinants of Tau aggregation inhibitor potency. J Biol Chem288:32599-611 (2013) 
 
Isoform Tau-F of Microtubule-associated protein tau
Name:Isoform Tau-F of Microtubule-associated protein tau
Type:Enzyme Catalytic Domain
Mol. Mass.:45857.42
Organism:Homo sapiens (Human)
Description:P10636-8
Residue:441
BDBM214747
NameBDBM214747
Synonyms:Rhodanines, 35A
TypeSmall organic molecule
Emp. Form.C27H19N2O4S2
Mol. Mass.499.581
SMILES[O-]C(=O)Cc1ccc(CN2C(=S)S\C(=C/c3ccc(o3)-c3ccc(cc3)-n3cccc3)C2=O)cc1