Reaction Details
TargetIsoform Tau-F of Microtubule-associated protein tau
LigandBDBM214757
Substrate/Competitorn/a
Meas. Tech.Tau Protein Assay
pH7.4±n/a
IC50 2.56e+3±n/a nM
Commentsextracted
Citation Schafer, KNCisek, KHuseby, CJChang, EKuret, J Structural determinants of Tau aggregation inhibitor potency. J Biol Chem288:32599-611 (2013) 
 
Isoform Tau-F of Microtubule-associated protein tau
Name:Isoform Tau-F of Microtubule-associated protein tau
Type:Enzyme Catalytic Domain
Mol. Mass.:45857.42
Organism:Homo sapiens (Human)
Description:P10636-8
Residue:441
BDBM214757
NameBDBM214757
Synonyms:Rhodanines, 45A
TypeSmall organic molecule
Emp. Form.C18H14ClNO6
Mol. Mass.375.76
SMILESCCOC(=O)CN1C(=O)O\C(=C/c2ccc(o2)-c2cccc(Cl)c2)C1=O