Reaction Details
TargetPoly [ADP-ribose] polymerase 1
LigandBDBM213899
Substrate/Competitorn/a
Meas. Tech.PARP Enzyme Inhibition Assay
pH8±n/a
Ki 0.7±n/a nM
Commentsextracted
Citation Gandhi, VBGiranda, VLGong, JPenning, TDZhu, G Inhibitors of poly(ADP-ribose)polymerase US Patent US9283222 Publication Date 3/15/2016
 
Poly [ADP-ribose] polymerase 1
Name:Poly [ADP-ribose] polymerase 1
Type:n/a
Mol. Mass.:113114.22
Organism:Homo sapiens (Human)
Description:P09874
Residue:1014
BDBM213899
NameBDBM213899
Synonyms:BDBM214226 | US9283222, Table 3, Compound 6
TypeSmall organic molecule
Emp. Form.C26H26FN3O4
Mol. Mass.463.5007
SMILESCOc1ccc(cc1)C(=O)CCC(=O)Nc1cc(Cc2n[nH]c(=O)c3CCCCc23)ccc1F