Reaction Details
TargetPoly [ADP-ribose] polymerase 1
LigandBDBM213913
Substrate/Competitorn/a
Meas. Tech.PARP Enzyme Inhibition Assay
pH8±n/a
Ki 0.1±n/a nM
Commentsextracted
Citation Gandhi, VBGiranda, VLGong, JPenning, TDZhu, G Inhibitors of poly(ADP-ribose)polymerase US Patent US9283222 Publication Date 3/15/2016
 
Poly [ADP-ribose] polymerase 1
Name:Poly [ADP-ribose] polymerase 1
Type:n/a
Mol. Mass.:113114.22
Organism:Homo sapiens (Human)
Description:P09874
Residue:1014
BDBM213913
NameBDBM213913
Synonyms:BDBM214427 | US9283222, Table 3, Compound 20
TypeSmall organic molecule
Emp. Form.C22H25FN4O3
Mol. Mass.412.4573
SMILESCC(=O)N1CCN(CC1)C(=O)c1cc(Cc2n[nH]c(=O)c3CCCCc23)ccc1F