Reaction Details
TargetPoly [ADP-ribose] polymerase 1
LigandBDBM214463
Substrate/Competitorn/a
Meas. Tech.PARP Enzyme Inhibition Assay
pH8±n/a
Ki 0.9±n/a nM
Commentsextracted
Citation Gandhi, VBGiranda, VLGong, JPenning, TDZhu, G Inhibitors of poly(ADP-ribose)polymerase US Patent US9283222 Publication Date 3/15/2016
 
Poly [ADP-ribose] polymerase 1
Name:Poly [ADP-ribose] polymerase 1
Type:n/a
Mol. Mass.:113114.22
Organism:Homo sapiens (Human)
Description:P09874
Residue:1014
BDBM214463
NameBDBM214463
Synonyms:US9283222, 567
TypeSmall organic molecule
Emp. Form.C24H29FN6O3
Mol. Mass.468.5239
SMILESFc1ccc(Cc2n[nH]c(=O)c3CCCNc23)cc1C(=O)N1CCN(CC1)C(=O)N1CCCC1