Reaction Details
TargetPoly [ADP-ribose] polymerase 1
LigandBDBM214619
Substrate/Competitorn/a
Meas. Tech.PARP Enzyme Inhibition Assay
pH8±n/a
Ki 1±n/a nM
Commentsextracted
Citation Gandhi, VBGiranda, VLGong, JPenning, TDZhu, G Inhibitors of poly(ADP-ribose)polymerase US Patent US9283222 Publication Date 3/15/2016
 
Poly [ADP-ribose] polymerase 1
Name:Poly [ADP-ribose] polymerase 1
Type:n/a
Mol. Mass.:113114.22
Organism:Homo sapiens (Human)
Description:P09874
Residue:1014
BDBM214619
NameBDBM214619
Synonyms:US9283222, 748
TypeSmall organic molecule
Emp. Form.C26H27FN6O3
Mol. Mass.490.5294
SMILESFc1ccc(Cc2n[nH]c(=O)c3CCCNc23)cc1C(=O)N1CCC(CC1)NC(=O)c1ccncc1