Reaction Details
TargetPoly [ADP-ribose] polymerase 1
LigandBDBM214630
Substrate/Competitorn/a
Meas. Tech.PARP Enzyme Inhibition Assay
pH8±n/a
Ki 0.6±n/a nM
Commentsextracted
Citation Gandhi, VBGiranda, VLGong, JPenning, TDZhu, G Inhibitors of poly(ADP-ribose)polymerase US Patent US9283222 Publication Date 3/15/2016
 
Poly [ADP-ribose] polymerase 1
Name:Poly [ADP-ribose] polymerase 1
Type:n/a
Mol. Mass.:113114.22
Organism:Homo sapiens (Human)
Description:P09874
Residue:1014
BDBM214630
NameBDBM214630
Synonyms:US9283222, 761
TypeSmall organic molecule
Emp. Form.C24H29FN4O3
Mol. Mass.440.5105
SMILESCCN(CCNC(=O)C1CC1)C(=O)c1cc(Cc2n[nH]c(=O)c3CCCCc23)ccc1F