Reaction Details
TargetPoly [ADP-ribose] polymerase 1
LigandBDBM213905
Substrate/Competitorn/a
Meas. Tech.PARP Enzyme Inhibition Assay
pH8±n/a
Ki 0.6±n/a nM
Commentsextracted
Citation Gandhi, VBGiranda, VLGong, JPenning, TDZhu, G Inhibitors of poly(ADP-ribose)polymerase US Patent US9283222 Publication Date 3/15/2016
 
Poly [ADP-ribose] polymerase 1
Name:Poly [ADP-ribose] polymerase 1
Type:n/a
Mol. Mass.:113114.22
Organism:Homo sapiens (Human)
Description:P09874
Residue:1014
BDBM213905
NameBDBM213905
Synonyms:BDBM214387 | US9283222, Table 3, Compound 12
TypeSmall organic molecule
Emp. Form.C26H27FN4O3
Mol. Mass.462.516
SMILESFc1ccc(Cc2n[nH]c(=O)c3CCCCc23)cc1NC(=O)CCCC(=O)Nc1ccccc1