Reaction Details
TargetPoly [ADP-ribose] polymerase 1
LigandBDBM213910
Substrate/Competitorn/a
Meas. Tech.PARP Enzyme Inhibition Assay
pH8±n/a
Ki 0.8±n/a nM
Commentsextracted
Citation Gandhi, VBGiranda, VLGong, JPenning, TDZhu, G Inhibitors of poly(ADP-ribose)polymerase US Patent US9283222 Publication Date 3/15/2016
 
Poly [ADP-ribose] polymerase 1
Name:Poly [ADP-ribose] polymerase 1
Type:n/a
Mol. Mass.:113114.22
Organism:Homo sapiens (Human)
Description:P09874
Residue:1014
BDBM213910
NameBDBM213910
Synonyms:BDBM214372 | US9283222, Table 3, Compound 17
TypeSmall organic molecule
Emp. Form.C24H26N6O2
Mol. Mass.430.5022
SMILESO=C(N1CCN(CC1)c1ncccn1)c1cccc(Cc2n[nH]c(=O)c3CCCCc23)c1