Reaction Details
TargetBifunctional epoxide hydrolase 2
LigandBDBM50335967
Substrate/Competitorn/a
Meas. Tech.t-DPPO
IC50 37.5±n/a nM
Citation Hammock, BDRose, TMorisseau, CLee, KS Acyl piperidine inhibitors of soluble epoxide hydrolase US Patent US9296693 Publication Date 3/29/2016
 
Bifunctional epoxide hydrolase 2
Name:Bifunctional epoxide hydrolase 2
Type:Enzyme
Mol. Mass.:62512.06
Organism:Mus musculus (Mouse)
Description:P34914
Residue:554
BDBM50335967
NameBDBM50335967
Synonyms:1-(1-(isopropylsulfonyl)piperidin-4-yl)-3-(4-(trifluoromethyl)phenyl)urea | CHEMBL1668939
TypeSmall organic molecule
Emp. Form.C16H22F3N3O3S
Mol. Mass.393.424
SMILESCC(C)S(=O)(=O)N1CCC(CC1)NC(=O)Nc1ccc(cc1)C(F)(F)F