Reaction Details
TargetBifunctional epoxide hydrolase 2
LigandBDBM50327818
Substrate/Competitorn/a
Meas. Tech.Fluorescent Based Assay
pH7±n/a
IC50 1.3±n/a nM
Commentsextracted
Citation Hammock, BDRose, TMorisseau, CLee, KS Acyl piperidine inhibitors of soluble epoxide hydrolase US Patent US9296693 Publication Date 3/29/2016
 
Bifunctional epoxide hydrolase 2
Name:Bifunctional epoxide hydrolase 2
Type:Enzyme
Mol. Mass.:62512.06
Organism:Mus musculus (Mouse)
Description:P34914
Residue:554
BDBM50327818
NameBDBM50327818
Synonyms:1-(4-Ethylphenyl)-3-(1-propionylpiperidin-4-yl)urea US9296693, 13
TypeSmall organic molecule
Emp. Form.C17H25N3O2
Mol. Mass.303.3993
SMILESCCC(=O)N1CCC(CC1)NC(=O)Nc1ccc(CC)cc1