Reaction Details
TargetBifunctional epoxide hydrolase 2
LigandBDBM50327816
Substrate/Competitorn/a
Meas. Tech.Fluorescent Based Assay
pH7±n/a
IC50 1.4±n/a nM
Commentsextracted
Citation Hammock, BDRose, TMorisseau, CLee, KS Acyl piperidine inhibitors of soluble epoxide hydrolase US Patent US9296693 Publication Date 3/29/2016
 
Bifunctional epoxide hydrolase 2
Name:Bifunctional epoxide hydrolase 2
Type:Enzyme
Mol. Mass.:62512.06
Organism:Mus musculus (Mouse)
Description:P34914
Residue:554
BDBM50327816
NameBDBM50327816
Synonyms:1-(4-Iodophenyl)-3-(1-propionylpiperidin-4-yl)urea US9296693, 27
TypeSmall organic molecule
Emp. Form.C15H20IN3O2
Mol. Mass.401.2427
SMILESCCC(=O)N1CCC(CC1)NC(=O)Nc1ccc(I)cc1