Reaction Details
TargetBifunctional epoxide hydrolase 2
LigandBDBM50327853
Substrate/Competitorn/a
Meas. Tech.Fluorescent Based Assay
pH7±n/a
IC50 0.6±n/a nM
Commentsextracted
Citation Hammock, BDRose, TMorisseau, CLee, KS Acyl piperidine inhibitors of soluble epoxide hydrolase US Patent US9296693 Publication Date 3/29/2016
 
Bifunctional epoxide hydrolase 2
Name:Bifunctional epoxide hydrolase 2
Type:Enzyme
Mol. Mass.:62512.06
Organism:Mus musculus (Mouse)
Description:P34914
Residue:554
BDBM50327853
NameBDBM50327853
Synonyms:1-(3,4-Dichlorophenyl)-3-(1-propionylpiperidin-4-yl)urea US9296693, 32
TypeSmall organic molecule
Emp. Form.C15H19Cl2N3O2
Mol. Mass.344.236
SMILESCCC(=O)N1CCC(CC1)NC(=O)Nc1ccc(Cl)c(Cl)c1