Reaction Details
TargetBifunctional epoxide hydrolase 2
LigandBDBM50327845
Substrate/Competitorn/a
Meas. Tech.Fluorescent Based Assay
pH7±n/a
IC50 0.7±n/a nM
Commentsextracted
Citation Hammock, BDRose, TMorisseau, CLee, KS Acyl piperidine inhibitors of soluble epoxide hydrolase US Patent US9296693 Publication Date 3/29/2016
 
Bifunctional epoxide hydrolase 2
Name:Bifunctional epoxide hydrolase 2
Type:Enzyme
Mol. Mass.:62512.06
Organism:Mus musculus (Mouse)
Description:P34914
Residue:554
BDBM50327845
NameBDBM50327845
Synonyms:1-(4-Perfluoroisopropylphenyl)-3-(1-propionylpiperidin-4-yl)urea US9296693, 38
TypeSmall organic molecule
Emp. Form.C18H20F7N3O2
Mol. Mass.443.3591
SMILESCCC(=O)N1CCC(CC1)NC(=O)Nc1ccc(cc1)C(F)(C(F)(F)F)C(F)(F)F