Reaction Details
TargetBifunctional epoxide hydrolase 2
LigandBDBM50327855
Substrate/Competitorn/a
Meas. Tech.Fluorescent Based Assay
pH7±n/a
IC50 1.3±n/a nM
Commentsextracted
Citation Hammock, BDRose, TMorisseau, CLee, KS Acyl piperidine inhibitors of soluble epoxide hydrolase US Patent US9296693 Publication Date 3/29/2016
 
Bifunctional epoxide hydrolase 2
Name:Bifunctional epoxide hydrolase 2
Type:Enzyme
Mol. Mass.:62512.06
Organism:Mus musculus (Mouse)
Description:P34914
Residue:554
BDBM50327855
NameBDBM50327855
Synonyms:1-(1-Isonicotinoylpiperidin-4-yl)-3-(4-(trifluoromethoxy)phenyl)urea US9296693, 47
TypeSmall organic molecule
Emp. Form.C19H19F3N4O3
Mol. Mass.408.3744
SMILESFC(F)(F)Oc1ccc(NC(=O)NC2CCN(CC2)C(=O)c2ccncc2)cc1