Reaction Details
TargetBifunctional epoxide hydrolase 2
LigandBDBM50327847
Substrate/Competitorn/a
Meas. Tech.Fluorescent Based Assay
pH7±n/a
IC50 0.4±n/a nM
Commentsextracted
Citation Hammock, BDRose, TMorisseau, CLee, KS Acyl piperidine inhibitors of soluble epoxide hydrolase US Patent US9296693 Publication Date 3/29/2016
 
Bifunctional epoxide hydrolase 2
Name:Bifunctional epoxide hydrolase 2
Type:Enzyme
Mol. Mass.:62512.06
Organism:Mus musculus (Mouse)
Description:P34914
Residue:554
BDBM50327847
NameBDBM50327847
Synonyms:1-(1-(Trifluoroacetyl)piperidin-4-yl)-3-(4-(trifluoromethoxy)phenyl)urea US8501783, 1591 | US9296693, 53
TypeSmall organic molecule
Emp. Form.C15H15F6N3O3
Mol. Mass.399.2883
SMILESFC(F)(F)Oc1ccc(NC(=O)NC2CCN(CC2)C(=O)C(F)(F)F)cc1